Reaction Details
TargetNitric oxide synthase, inducible
LigandBDBM275053
Substrate/Competitorn/a
Meas. Tech.Caco-2 Assay
Ki 1900±n/a nM
Citation Silverman, RBMukherjee, PNguyen, HM 2-imidazolyl-pyrimidine scaffolds as potent and selective inhibitors of neuronal nitric oxide synthase US Patent US9878996 Publication Date 1/30/2018
 
Nitric oxide synthase, inducible
Name:Nitric oxide synthase, inducible
Type:Homodimer
Mol. Mass.:131141.95
Organism:Homo sapiens (Human)
Description:P35228
Residue:1153
BDBM275053
NameBDBM275053
Synonyms:US9878996, Compound 26
TypeSmall organic molecule
Emp. Form.C19H20FN5
Mol. Mass.337.394
SMILESFc1cccc(c1)C1CC1CNCCc1ccnc(n1)-n1ccnc1