Reaction Details
TargetMelatonin receptor
LigandBDBM29612
Substrate/Competitorn/a
Ki 273±n/a nM
CommentsPDSP_1708
Citation Dubocovich, MLMasana, MIIacob, SSauri, DM Melatonin receptor antagonists that differentiate between the human Mel1a and Mel1b recombinant subtypes are used to assess the pharmacological profile of the rabbit retina ML1 presynaptic heteroreceptor. Naunyn Schmiedebergs Arch Pharmacol355:365-75 (1997) 
 
Melatonin receptor
Name:Melatonin receptor
Type:Enzyme Catalytic Domain
Mol. Mass.:13287.02
Organism:RABBIT
Description:Q9BE38
Residue:114
BDBM29612
NameBDBM29612
Synonyms:CHEMBL33103 JOH-MSK-a63bdd1d-4 N-Acetyl-5-hydroxytryptamine N-acetylserotonin Serotonin,N-acetyl
TypeSmall organic molecule
Emp. Form.C12H14N2O2
Mol. Mass.218.2518
SMILESCC(=O)NCCc1c[nH]c2ccc(O)cc12