Reaction Details
TargetMelatonin receptor type 1A
LigandBDBM85062
Substrate/Competitorn/a
Ki 154±n/a nM
CommentsPDSP_1261
Citation Dubocovich, MLMasana, MIIacob, SSauri, DM Melatonin receptor antagonists that differentiate between the human Mel1a and Mel1b recombinant subtypes are used to assess the pharmacological profile of the rabbit retina ML1 presynaptic heteroreceptor. Naunyn Schmiedebergs Arch Pharmacol355:365-75 (1997) 
 
Melatonin receptor type 1A
Name:Melatonin receptor type 1A
Type:Enzyme
Mol. Mass.:39392.94
Organism:Homo sapiens (Human)
Description:P48039
Residue:350
BDBM85062
NameBDBM85062
Synonyms:Luzindole,N-propanoyl N-0889 | N-[2-(2-Benzyl-1H-indol-3-yl)ethyl]propionamide
TypeSmall organic molecule
Emp. Form.C20H22N2O
Mol. Mass.306.4015
SMILESCCC(=O)NCCc1c(Cc2ccccc2)[nH]c2ccccc12