Reaction Details
TargetMelatonin receptor type 1B
LigandBDBM85064
Substrate/Competitorn/a
Ki 0.48±n/a nM
CommentsPDSP_886
Citation Dubocovich, MLMasana, MIIacob, SSauri, DM Melatonin receptor antagonists that differentiate between the human Mel1a and Mel1b recombinant subtypes are used to assess the pharmacological profile of the rabbit retina ML1 presynaptic heteroreceptor. Naunyn Schmiedebergs Arch Pharmacol355:365-75 (1997) 
 
Melatonin receptor type 1B
Name:Melatonin receptor type 1B
Type:Enzyme
Mol. Mass.:40203.54
Organism:Homo sapiens (Human)
Description:P49286
Residue:362
BDBM85064
NameBDBM85064
Synonyms:CAS_5311134 NSC_5311134
TypeSmall organic molecule
Emp. Form.C14H18N2O2
Mol. Mass.246.3049
SMILESCC(=O)NCCN1CCc2ccc3OCCc3c12