Reaction Details
TargetMelatonin receptor type 1B
LigandBDBM85065
Substrate/Competitorn/a
Ki 10.2±n/a nM
CommentsPDSP_1123
Citation Dubocovich, MLMasana, MIIacob, SSauri, DM Melatonin receptor antagonists that differentiate between the human Mel1a and Mel1b recombinant subtypes are used to assess the pharmacological profile of the rabbit retina ML1 presynaptic heteroreceptor. Naunyn Schmiedebergs Arch Pharmacol355:365-75 (1997) 
 
Melatonin receptor type 1B
Name:Melatonin receptor type 1B
Type:Enzyme
Mol. Mass.:40203.54
Organism:Homo sapiens (Human)
Description:P49286
Residue:362
BDBM85065
NameBDBM85065
Synonyms:CAS_117946-91-5 NSC_122162
TypeSmall organic molecule
Emp. Form.C19H20N2O
Mol. Mass.292.3749
SMILESCC(=O)NCCc1c(Cc2ccccc2)[nH]c2ccccc12