Reaction Details
TargetMelatonin receptor type 1B
LigandBDBM29611
Substrate/Competitorn/a
Ki 0.22±n/a nM
CommentsPDSP_1192
Citation Dubocovich, MLMasana, MIIacob, SSauri, DM Melatonin receptor antagonists that differentiate between the human Mel1a and Mel1b recombinant subtypes are used to assess the pharmacological profile of the rabbit retina ML1 presynaptic heteroreceptor. Naunyn Schmiedebergs Arch Pharmacol355:365-75 (1997) 
 
Melatonin receptor type 1B
Name:Melatonin receptor type 1B
Type:Enzyme
Mol. Mass.:40203.54
Organism:Homo sapiens (Human)
Description:P49286
Residue:362
BDBM29611
NameBDBM29611
Synonyms:2-Iodomelatonin Melatonin,2-Iodo
TypeSmall organic molecule
Emp. Form.C13H15IN2O2
Mol. Mass.358.1749
SMILESCOc1ccc2[nH]c(I)c(CCNC(C)=O)c2c1