Reaction Details
TargetCB1 cannabinoid receptor-interacting protein 1
LigandBDBM21015
Substrate/Competitorn/a
Ki 1000±n/a nM
CommentsPDSP_616
Citation Stefano, GBSalzet, BSalzet, M Identification and characterization of the leech CNS cannabinoid receptor: coupling to nitric oxide release. Brain Res753:219-24 (1997) 
 
CB1 cannabinoid receptor-interacting protein 1
Name:CB1 cannabinoid receptor-interacting protein 1
Type:Enzyme Catalytic Domain
Mol. Mass.:22425.67
Organism:theromyzon Tessulatum
Description:CANNABINOID CB1 CNR1 theromyzon Tessulatum::A0A0V1DID4
Residue:196
BDBM21015
NameBDBM21015
Synonyms:(2S)-2-{2-[(2R)-2-[(2S)-2-amino-3-(4-hydroxyphenyl)propanamido]propanamido]-N-methylacetamido}-N-(2-hydroxyethyl)-3-phenylpropanamide CHEMBL38874 DAMGO US11492374, ID 2 [tyrosyl-3,5-3H(N)]-D-Ala2-Mephe4-glyol5-enkephalin
TypeAnalgesics
Emp. Form.C26H35N5O6
Mol. Mass.513.586
SMILESC[C@@H](NC(=O)[C@@H](N)Cc1ccc(O)cc1)C(=O)NCC(=O)N(C)[C@@H](Cc1ccccc1)C(=O)NCCO