Reaction Details
TargetCB1 cannabinoid receptor-interacting protein 1
LigandBDBM24183
Substrate/Competitorn/a
Ki 1000±n/a nM
CommentsPDSP_867
Citation Stefano, GBSalzet, BSalzet, M Identification and characterization of the leech CNS cannabinoid receptor: coupling to nitric oxide release. Brain Res753:219-24 (1997) 
 
CB1 cannabinoid receptor-interacting protein 1
Name:CB1 cannabinoid receptor-interacting protein 1
Type:Enzyme Catalytic Domain
Mol. Mass.:22425.67
Organism:theromyzon Tessulatum
Description:CANNABINOID CB1 CNR1 theromyzon Tessulatum::A0A0V1DID4
Residue:196
BDBM24183
NameBDBM24183
Synonyms:4-amino-n-[2,3-3H]butyric acid Aminalon GABA [3H]GABA | cid_119
TypeRadiolabeled ligand
Emp. Form.C4H9NO2
Mol. Mass.103.1198
SMILESNCCCC(O)=O