Reaction Details
TargetCB1 cannabinoid receptor-interacting protein 1
LigandBDBM35234
Substrate/Competitorn/a
Ki 1000±n/a nM
CommentsPDSP_1348
Citation Stefano, GBSalzet, BSalzet, M Identification and characterization of the leech CNS cannabinoid receptor: coupling to nitric oxide release. Brain Res753:219-24 (1997) 
 
CB1 cannabinoid receptor-interacting protein 1
Name:CB1 cannabinoid receptor-interacting protein 1
Type:Enzyme Catalytic Domain
Mol. Mass.:22425.67
Organism:theromyzon Tessulatum
Description:CANNABINOID CB1 CNR1 theromyzon Tessulatum::A0A0V1DID4
Residue:196
BDBM35234
NameBDBM35234
Synonyms:DL-[7-3H]norepinephrine Noradrenaline,(+) | [3H]NE
Typeradiolabeled ligand
Emp. Form.C8H11NO3
Mol. Mass.169.1778
SMILESNCC(O)c1ccc(O)c(O)c1