Reaction Details
TargetCB1 cannabinoid receptor-interacting protein 1
LigandBDBM21281
Substrate/Competitorn/a
Ki 58.6±n/a nM
CommentsPDSP_1966
Citation Stefano, GBSalzet, BSalzet, M Identification and characterization of the leech CNS cannabinoid receptor: coupling to nitric oxide release. Brain Res753:219-24 (1997) 
 
CB1 cannabinoid receptor-interacting protein 1
Name:CB1 cannabinoid receptor-interacting protein 1
Type:Enzyme Catalytic Domain
Mol. Mass.:22425.67
Organism:theromyzon Tessulatum
Description:CANNABINOID CB1 CNR1 theromyzon Tessulatum::A0A0V1DID4
Residue:196
BDBM21281
NameBDBM21281
Synonyms:(11R)-2-methyl-11-(morpholin-4-ylmethyl)-3-(naphthalen-1-ylcarbonyl)-9-oxa-1-azatricyclo[6.3.1.0^{4,12}]dodeca-2,4(12),5,7-tetraene CHEMBL188 WIN 55212-2 WIN55212-2
TypeAnalgesic
Emp. Form.C27H26N2O3
Mol. Mass.426.5069
SMILESCc1c(C(=O)c2cccc3ccccc23)c2cccc3OC[C@@H](CN4CCOCC4)n1c23