Reaction Details
TargetMetabotropic glutamate receptor 1
LigandBDBM17660
Substrate/Competitorn/a
Ki 200±n/a nM
CommentsPDSP_1580
Citation Conn, PJPin, JP Pharmacology and functions of metabotropic glutamate receptors. Annu Rev Pharmacol Toxicol37:205-37 (1997) 
 
Metabotropic glutamate receptor 1
Name:Metabotropic glutamate receptor 1
Type:Enzyme
Mol. Mass.:132358.19
Organism:Homo sapiens (Human)
Description:Q13255
Residue:1194
BDBM17660
NameBDBM17660
Synonyms:(2S)-2-amino-3-(3,5-dioxo-1,2,4-oxadiazolidin-2-yl)propanoic acid CHEMBL279956 Quisqualate, L | quisqualic acid
TypeSmall organic molecule
Emp. Form.C5H7N3O5
Mol. Mass.189.1262
SMILESN[C@@H](Cn1oc(=O)[nH]c1=O)C(O)=O