Reaction Details
TargetMetabotropic glutamate receptor 6
LigandBDBM50004863
Substrate/Competitorn/a
Ki>10000±n/a nM
CommentsPDSP_96
Citation Conn, PJPin, JP Pharmacology and functions of metabotropic glutamate receptors. Annu Rev Pharmacol Toxicol37:205-37 (1997) 
 
Metabotropic glutamate receptor 6
Name:Metabotropic glutamate receptor 6
Type:Enzyme Catalytic Domain
Mol. Mass.:95479.26
Organism:Homo sapiens (Human)
Description:metabotropic glutamate 6 GRM6 HUMAN::O15303
Residue:877
BDBM50004863
NameBDBM50004863
Synonyms:(+/-)-trans-ACPD (1S,3S)-1-aminocyclopentane-1,3-dicarboxylic acid 1-Amino-cyclopentane-1,3-dicarboxylic acid(cis-(1S,3S)-ACPD) 1R,3S-ACPD CHEMBL29726
TypeSmall organic molecule
Emp. Form.C7H11NO4
Mol. Mass.173.1665
SMILESN[C@]1(CC[C@@H](C1)C(O)=O)C(O)=O