Reaction Details
TargetMetabotropic glutamate receptor 6
LigandBDBM50004051
Substrate/Competitorn/a
Ki 900±n/a nM
CommentsPDSP_2029
Citation Conn, PJPin, JP Pharmacology and functions of metabotropic glutamate receptors. Annu Rev Pharmacol Toxicol37:205-37 (1997) 
 
Metabotropic glutamate receptor 6
Name:Metabotropic glutamate receptor 6
Type:Enzyme Catalytic Domain
Mol. Mass.:95479.26
Organism:Homo sapiens (Human)
Description:metabotropic glutamate 6 GRM6 HUMAN::O15303
Residue:877
BDBM50004051
NameBDBM50004051
Synonyms:2-Amino-4-phosphono-butyric acid 4-Amino Phosphonobutyrate GlcN-6-P synthase inhibitor, 1 (racemic mixture) | L-AP4
TypeSmall organic molecule
Emp. Form.C4H10NO5P
Mol. Mass.183.0997
SMILESNC(CCP(O)(O)=O)C(O)=O