Reaction Details
TargetMetabotropic glutamate receptor 8
LigandBDBM17657
Substrate/Competitorn/a
Ki 20±n/a nM
CommentsPDSP_873
Citation Conn, PJPin, JP Pharmacology and functions of metabotropic glutamate receptors. Annu Rev Pharmacol Toxicol37:205-37 (1997) 
 
Metabotropic glutamate receptor 8
Name:Metabotropic glutamate receptor 8
Type:Enzyme Catalytic Domain
Mol. Mass.:101759.58
Organism:Homo sapiens (Human)
Description:metabotropic glutamate 8 GRM8 HUMAN::O00222
Residue:908
BDBM17657
NameBDBM17657
Synonyms:(2S)-2-aminopentanedioic acid D-Glutamate L-Glu L-Glutamic acid L-gluatmate
TypeAmino Acid
Emp. Form.C5H9NO4
Mol. Mass.147.1293
SMILESN[C@@H](CCC(O)=O)C(O)=O