Reaction Details
Target5-hydroxytryptamine receptor 7
LigandBDBM35256
Substrate/Competitorn/a
Ki 63.10±n/a nM
CommentsPDSP_1235
Citation Eglen, RMJasper, JRChang, DJMartin, GR The 5-HT7 receptor: orphan found. Trends Pharmacol Sci18:104-7 (1997) 
 
5-hydroxytryptamine receptor 7
Name:5-hydroxytryptamine receptor 7
Type:G Protein-Coupled Receptor (GPCR)
Mol. Mass.:49852.62
Organism:Rattus norvegicus (rat)
Description:Rat cloned 5-HT7R.
Residue:448
BDBM35256
NameBDBM35256
Synonyms:(S)-mianserin MIANSERIN MIANSERIN (-) | Tolvon
TypeSmall organic molecule
Emp. Form.C18H20N2
Mol. Mass.264.3648
SMILES[H][C@]12CN(C)CCN1c1ccccc1Cc1ccccc21