Reaction Details
Target5-hydroxytryptamine receptor 1A
LigandBDBM50019443
Substrate/Competitorn/a
Ki 47±n/a nM
CommentsPDSP_1495
Citation Mos, JVan Hest, AVan Drimmelen, MHerremans, AHOlivier, B The putative 5-HT1A receptor antagonist DU125530 blocks the discriminative stimulus of the 5-HT1A receptor agonist flesinoxan in pigeons. Eur J Pharmacol325:145-53 (1997) 
 
5-hydroxytryptamine receptor 1A
Name:5-hydroxytryptamine receptor 1A
Type:Enzyme Catalytic Domain
Mol. Mass.:45800.53
Organism:pigeon
Description:5-HT1A HTR1A pigeon::A0A1V4KRM0
Residue:413
BDBM50019443
NameBDBM50019443
Synonyms:1-(1H-Indol-4-yloxy)-3-isopropylamino-propan-2-ol 1-(1H-Indol-4-yloxy)-3-isopropylamino-propan-2-ol(pindolol) LB-46 PINDOLOL,(-) VISKAZIDE | VISKEN
TypeSmall organic molecule
Emp. Form.C14H20N2O2
Mol. Mass.248.3208
SMILESCC(C)NCC(O)COc1cccc2[nH]ccc12