Reaction Details
Target5-hydroxytryptamine receptor 1B
LigandBDBM50013019
Substrate/Competitorn/a
Ki>10000±n/a nM
CommentsPDSP_5
Citation Mos, JVan Hest, AVan Drimmelen, MHerremans, AHOlivier, B The putative 5-HT1A receptor antagonist DU125530 blocks the discriminative stimulus of the 5-HT1A receptor agonist flesinoxan in pigeons. Eur J Pharmacol325:145-53 (1997) 
 
5-hydroxytryptamine receptor 1B
Name:5-hydroxytryptamine receptor 1B
Type:Enzyme Catalytic Domain
Mol. Mass.:42162.70
Organism:pigeon
Description:5-HT1B HTR1B pigeon::A0A1V4JMG2
Residue:379
BDBM50013019
NameBDBM50013019
Synonyms:(S)-7-(dipropylamino)-4-fluoro-5,6,7,8-tetrahydronaphthalen-1-ol (S)-UH-301 7-Dipropylamino-4-fluoro-5,6,7,8-tetrahydro-naphthalen-1-ol ((S)-UH301) UH-301
TypeSmall organic molecule
Emp. Form.C16H24FNO
Mol. Mass.265.3663
SMILESCCCN(CCC)[C@H]1CCc2c(F)ccc(O)c2C1