Reaction Details
TargetAlpha-1A adrenergic receptor
LigandBDBM86708
Substrate/Competitorn/a
Ki 120±n/a nM
CommentsPDSP_1954
Citation Mos, JVan Hest, AVan Drimmelen, MHerremans, AHOlivier, B The putative 5-HT1A receptor antagonist DU125530 blocks the discriminative stimulus of the 5-HT1A receptor agonist flesinoxan in pigeons. Eur J Pharmacol325:145-53 (1997) 
 
Alpha-1A adrenergic receptor
Name:Alpha-1A adrenergic receptor
Synonyms:adrenergic Alpha1
Type:Enzyme Catalytic Domain
Mol. Mass.:50699.64
Organism:pigeon
Description:adrenergic Alpha1 0 pigeon::A0A1V4KJJ8
Residue:464
BDBM86708
NameBDBM86708
TypeSmall organic molecule
Emp. Form.C25H34N4O2
Mol. Mass.422.5631
SMILESCOc1ccccc1N1CCN(CCN(C(=O)C2CCCCC2)c2ccccn2)CC1