Reaction Details
TargetD(3) dopamine receptor
LigandBDBM86708
Substrate/Competitorn/a
Ki 370±n/a nM
CommentsPDSP_1954
Citation Mos, JVan Hest, AVan Drimmelen, MHerremans, AHOlivier, B The putative 5-HT1A receptor antagonist DU125530 blocks the discriminative stimulus of the 5-HT1A receptor agonist flesinoxan in pigeons. Eur J Pharmacol325:145-53 (1997) 
 
D(3) dopamine receptor
Name:D(3) dopamine receptor
Type:Enzyme Catalytic Domain
Mol. Mass.:47809.00
Organism:pigeon
Description:DOPAMINE D3 DRD3 pigeon::A0A1V4J3K6
Residue:425
BDBM86708
NameBDBM86708
Synonyms:CAS_146714-97-8 CHEMBL514874 NSC_104911 | WAY 100,635
TypeSmall organic molecule
Emp. Form.C25H34N4O2
Mol. Mass.422.5631
SMILESCOc1ccccc1N1CCN(CCN(C(=O)C2CCCCC2)c2ccccn2)CC1