Reaction Details
TargetSomatostatin receptor type 1
LigandBDBM84629
Substrate/Competitorn/a
Ki 301±n/a nM
CommentsPDSP_385
Citation Viollet, CBodenant, CPrunotto, CRoosterman, DSchaefer, JMeyerhof, WEpelbaum, JVaudry, HLeroux, P Differential expression of multiple somatostatin receptors in the rat cerebellum during development. J Neurochem68:2263-72 (1997) 
 
Somatostatin receptor type 1
Name:Somatostatin receptor type 1
Type:Enzyme Catalytic Domain
Mol. Mass.:42752.93
Organism:RAT
Description:SOMATOSTATIN SST1 SSTR1 RAT::P28646
Residue:391
BDBM84629
NameBDBM84629
Synonyms:BIM 23056
TypeSmall organic molecule
Emp. Form.C71H81N11O9
Mol. Mass.1232.4711
SMILESCC(C)[C@H](NC(=O)[C@H](CCCCN)NC(=O)[C@@H](Cc1c[nH]c2ccccc12)NC(=O)[C@H](Cc1ccc(O)cc1)NC(=O)[C@H](Cc1ccccc1)NC(=O)[C@H](N)Cc1ccccc1)C(=O)N[C@@H](Cc1ccccc1)C(=O)N[C@H](Cc1cccc2ccccc12)C(N)=O