Reaction Details
TargetSomatostatin receptor type 3
LigandBDBM82253
Substrate/Competitorn/a
Ki 4.6±n/a nM
CommentsPDSP_382
Citation Viollet, CBodenant, CPrunotto, CRoosterman, DSchaefer, JMeyerhof, WEpelbaum, JVaudry, HLeroux, P Differential expression of multiple somatostatin receptors in the rat cerebellum during development. J Neurochem68:2263-72 (1997) 
 
Somatostatin receptor type 3
Name:Somatostatin receptor type 3
Type:Enzyme Catalytic Domain
Mol. Mass.:47161.54
Organism:RAT
Description:SOMATOSTATIN SST3 SSTR3 RAT::P30936
Residue:428
BDBM82253
NameBDBM82253
Synonyms:BIM 23052 | CAS_133073-82-2
TypeSmall organic molecule
Emp. Form.C61H75N11O10
Mol. Mass.1122.3159
SMILESC[C@@H](O)[C@H](NC(=O)[C@H](Cc1ccccc1)NC(=O)[C@@H](NC(=O)[C@H](CCCCN)NC(=O)[C@@H](Cc1c[nH]c2ccccc12)NC(=O)[C@H](Cc1ccccc1)NC(=O)[C@H](Cc1ccccc1)NC(=O)[C@H](N)Cc1ccccc1)[C@@H](C)O)C(N)=O