Reaction Details
TargetLeukotriene B4 receptor 2
LigandBDBM81521
Substrate/Competitorn/a
Ki 7.6±n/a nM
CommentsPDSP_44
Citation Yokomizo, TIzumi, TChang, KTakuwa, YShimizu, T A G-protein-coupled receptor for leukotriene B4 that mediates chemotaxis. Nature387:620-4 (1997) 
 
Leukotriene B4 receptor 2
Name:Leukotriene B4 receptor 2
Type:Enzyme Catalytic Domain
Mol. Mass.:37964.86
Organism:Homo sapiens (Human)
Description:Leukotriene 2 0 HUMAN::Q9NPC1
Residue:358
BDBM81521
NameBDBM81521
Synonyms:20-OH-LTB4 NSC_1589
TypeSmall organic molecule
Emp. Form.C20H32O5
Mol. Mass.352.4651
SMILESOCCCCCC=CCC(O)C=CC=CC=CC(O)CCCC(O)=O