Reaction Details
Target5-hydroxytryptamine receptor 1A
LigandBDBM50020192
Substrate/Competitorn/a
Ki 2.4±n/a nM
CommentsPDSP_1743
Citation Weber, JTHayataka, KO'Connor, MFParker, KK Rabbit cerebral cortex 5HT1a receptors. Comp Biochem Physiol C, Pharmacol Toxicol Endocrinol117:19-24 (1997) 
 
5-hydroxytryptamine receptor 1A
Name:5-hydroxytryptamine receptor 1A
Type:Enzyme Catalytic Domain
Mol. Mass.:18528.48
Organism:RABBIT
Description:Q9MZ11
Residue:170
BDBM50020192
NameBDBM50020192
Synonyms:8-(2,3-Dihydro-benzo[1,4]dioxin-2-ylmethyl)-1-phenyl-1,3,8-triaza-spiro[4.5]decan-4-one Spiroxatrine
TypeSmall organic molecule
Emp. Form.C22H25N3O3
Mol. Mass.379.4522
SMILESO=C1NCN(c2ccccc2)C11CCN(CC2COc3ccccc3O2)CC1