Reaction Details
TargetSubstance-K receptor
LigandBDBM50071112
Substrate/Competitorn/a
Ki 0.23±n/a nM
CommentsPDSP_1755
Citation Sarau, HMGriswold, DEPotts, WFoley, JJSchmidt, DBWebb, EFMartin, LDBrawner, MEElshourbagy, NAMedhurst, ADGiardina, GAHay, DW Nonpeptide tachykinin receptor antagonists: I. Pharmacological and pharmacokinetic characterization of SB 223412, a novel, potent and selective neurokinin-3 receptor antagonist. J Pharmacol Exp Ther281:1303-11 (1997) Substance-K receptor
Name:Substance-K receptor
Type:Protein
Mol. Mass.:44455.78
Organism:Homo sapiens (Human)
Description:P21452
Residue:398
BDBM50071112
NameBDBM50071112
Synonyms:CHEMBL56835 SR 48968
TypeSmall organic molecule
Emp. Form.C31H35Cl2N3O2
Mol. Mass.552.535
SMILESCN(CC(CCN1CCC(CC1)(NC(C)=O)c1ccccc1)c1ccc(Cl)c(Cl)c1)C(=O)c1ccccc1