Reaction Details
TargetD(4) dopamine receptor
LigandBDBM84637
Substrate/Competitorn/a
Ki 37.3±n/a nM
CommentsPDSP_1576
Citation Newman-Tancredi, AAudinot, VChaput, CVerrièle, LMillan, MJ [35S]Guanosine-5'-O-(3-thio)triphosphate binding as a measure of efficacy at human recombinant dopamine D4.4 receptors: actions of antiparkinsonian and antipsychotic agents. J Pharmacol Exp Ther282:181-91 (1997) D(4) dopamine receptor
Name:D(4) dopamine receptor
Type:Enzyme
Mol. Mass.:48373.19
Organism:Homo sapiens (Human)
Description:P21917
Residue:419
BDBM84637
NameBDBM84637
Synonyms:CAS_85760-74-3 NSC_54562 Quinpirole,(-) | US9359372, Quinpirole
TypeSmall organic molecule
Emp. Form.C13H21N3
Mol. Mass.219.3259
SMILESCCCN1CCC[C@@H]2Cc3[nH]ncc3C[C@@H]12