Reaction Details
TargetNicotinic acetylcholine receptor
LigandBDBM50004108
Substrate/Competitorn/a
Ki 22±n/a nM
CommentsPDSP_1311
Citation Dávila-García, MIMusachio, JLPerry, DCXiao, YHorti, ALondon, EDDannals, RFKellar, KJ [125I]IPH, an epibatidine analog, binds with high affinity to neuronal nicotinic cholinergic receptors. J Pharmacol Exp Ther282:445-51 (1997) Nicotinic acetylcholine receptor
Name:Nicotinic acetylcholine receptor
Type:Enzyme Catalytic Domain
Mol. Mass.:2478.99
Organism:RAT
Description:n-AChR 0 RAT::Q62594
Residue:23
BDBM50004108
NameBDBM50004108
Synonyms:(+-)-nicotine (RS)-nicotine CHEMBL440464 Nicotine-(+) US11667638, Example Nicotine US9284322, Nicotine nicotine
TypeSmall organic molecule
Emp. Form.C10H14N2
Mol. Mass.162.2316
SMILESCN1CCCC1c1cccnc1