Reaction Details
TargetSodium-dependent dopamine transporter
LigandBDBM50057628
Substrate/Competitorn/a
Ki 0.7±n/a nM
CommentsPDSP_354
Citation Garreau, LEmond, PBelzung, CGuilloteau, DFrangin, YBesnard, JCChalon, S N-(3-lodoprop-2E-enyl)-2beta-carbomethoxy-3beta-(3',4'-dichloro phenyl)nortropane (beta-CDIT), a tropane derivative: pharmacological characterization as a specific ligand for the dopamine transporter in the rodent brain. J Pharmacol Exp Ther282:467-74 (1997) Sodium-dependent dopamine transporter
Name:Sodium-dependent dopamine transporter
Type:Multi-pass membrane protein
Mol. Mass.:68749.45
Organism:Rattus norvegicus (rat)
Description:P23977
Residue:619
BDBM50057628
NameBDBM50057628
Synonyms:(2S,8R)-3-(3,4-Dichloro-phenyl)-8-((E)-3-iodo-allyl)-8-aza-bicyclo[3.2.1]octane-2-carboxylic acid methyl ester | Beta-CDIT
TypeSmall organic molecule
Emp. Form.C18H20Cl2INO2
Mol. Mass.480.167
SMILESCOC(=O)[C@@H]1C2CCC(CC1c1ccc(Cl)c(Cl)c1)N2C\C=C\I