Reaction Details
Target5-hydroxytryptamine receptor 1D
LigandBDBM85097
Substrate/Competitorn/a
Ki 398.1±n/a nM
CommentsPDSP_1670
Citation Kennett, GAWood, MDBright, FTrail, BRiley, GHolland, VAvenell, KYStean, TUpton, NBromidge, SForbes, ITBrown, AMMiddlemiss, DNBlackburn, TP SB 242084, a selective and brain penetrant 5-HT2C receptor antagonist. Neuropharmacology36:609-20 (1997) 
 
5-hydroxytryptamine receptor 1D
Name:5-hydroxytryptamine receptor 1D
Type:Enzyme Catalytic Domain
Mol. Mass.:41501.69
Organism:C.H.O.
Description:5-HT1D HTR1D C.H.O.::A0A1U8CB25
Residue:374
BDBM85097
NameBDBM85097
Synonyms:CAS_181632-25-7 SB 242084
TypeSmall organic molecule
Emp. Form.C21H19ClN4O2
Mol. Mass.394.854
SMILESCc1cc2CCN(C(=O)Nc3ccc(Oc4cccnc4C)nc3)c2cc1Cl