Reaction Details
TargetAlpha-1B adrenergic receptor
LigandBDBM85097
Substrate/Competitorn/a
Ki>10000±n/a nM
CommentsPDSP_1670
Citation Kennett, GAWood, MDBright, FTrail, BRiley, GHolland, VAvenell, KYStean, TUpton, NBromidge, SForbes, ITBrown, AMMiddlemiss, DNBlackburn, TP SB 242084, a selective and brain penetrant 5-HT2C receptor antagonist. Neuropharmacology36:609-20 (1997) 
 
Alpha-1B adrenergic receptor
Name:Alpha-1B adrenergic receptor
Type:Enzyme Catalytic Domain
Mol. Mass.:56514.13
Organism:C.H.O.
Description:adrenergic Alpha1B ADRA1B C.H.O.::P18841
Residue:515
BDBM85097
NameBDBM85097
Synonyms:CAS_181632-25-7 SB 242084
TypeSmall organic molecule
Emp. Form.C21H19ClN4O2
Mol. Mass.394.854
SMILESCc1cc2CCN(C(=O)Nc3ccc(Oc4cccnc4C)nc3)c2cc1Cl