Reaction Details
Target5-hydroxytryptamine receptor 2A
LigandBDBM50031942
Substrate/Competitorn/a
Ki 2.45±n/a nM
CommentsPDSP_1230
Citation Bonhaus, DWWeinhardt, KKTaylor, MDeSouza, AMcNeeley, PMSzczepanski, KFontana, DJTrinh, JRocha, CLDawson, MWFlippin, LAEglen, RM RS-102221: a novel high affinity and selective, 5-HT2C receptor antagonist. Neuropharmacology36:621-9 (1997) 
 
5-hydroxytryptamine receptor 2A
Name:5-hydroxytryptamine receptor 2A
Type:undefined
Mol. Mass.:52607.65
Organism:Homo sapiens (Human)
Description:P28223
Residue:471
BDBM50031942
NameBDBM50031942
Synonyms:(6aR,9R)-4,6a,7-Trimethyl-4,6,6a,7,8,9-hexahydro-indolo[4,3-fg]quinoline-9-carboxylic acid (1-hydroxymethyl-propyl)-amide (6aR,9R)-4-Methyl-4,6,6a,7,8,9-hexahydro-indolo[4,3-fg]quinoline-9-carboxylic acid (1-hydroxymethyl-propyl)-amide (methylsergide)4,7-Dimethyl-4,6,6a,7,8,9-hexahydro-indolo[4,3-fg]quinoline-9-carboxylic acid (1-hydroxymethyl-propyl)-amide CHEMBL1065 Sansert
TypeSmall organic molecule
Emp. Form.C21H27N3O2
Mol. Mass.353.458
SMILESCC[C@@H](CO)NC(=O)[C@H]1CN(C)[C@@H]2Cc3cn(C)c4cccc(C2=C1)c34