Reaction Details
Target5-hydroxytryptamine receptor 2A
LigandBDBM35256
Substrate/Competitorn/a
Ki 2.08±n/a nM
CommentsPDSP_1235
Citation Bonhaus, DWWeinhardt, KKTaylor, MDeSouza, AMcNeeley, PMSzczepanski, KFontana, DJTrinh, JRocha, CLDawson, MWFlippin, LAEglen, RM RS-102221: a novel high affinity and selective, 5-HT2C receptor antagonist. Neuropharmacology36:621-9 (1997) 
 
5-hydroxytryptamine receptor 2A
Name:5-hydroxytryptamine receptor 2A
Type:G Protein-Coupled Receptor (GPCR)
Mol. Mass.:52852.05
Organism:Rattus norvegicus (rat)
Description:Rat cortex membranes 5-HT2A receptors.
Residue:471
BDBM35256
NameBDBM35256
Synonyms:(S)-mianserin MIANSERIN MIANSERIN (-) | Tolvon
TypeSmall organic molecule
Emp. Form.C18H20N2
Mol. Mass.264.3648
SMILES[H][C@]12CN(C)CCN1c1ccccc1Cc1ccccc21