Reaction Details
TargetHomoserine kinase
LigandBDBM85126
Substrate/Competitorn/a
Meas. Tech.Enzyme Inhibition Assay
pH7.5±0
Temperature310.15±0 K
Ki 8.6e+3± 4e+2 nM
Citation De Pascale, GGriffiths, EJShakya, TNazi, IWright, GD Identification and characterization of new inhibitors of fungal homoserine kinase. Chembiochem12:1179-82 (2011) 
 
Homoserine kinase
Name:Homoserine kinase
Type:Enzyme
Mol. Mass.:33619.26
Organism:Escherichia coli
Description:P00547
Residue:310
BDBM85126
NameBDBM85126
Synonyms:Thr1 inhibitor, 6
TypeSmall organic molecule
Emp. Form.C14H12F3N3O
Mol. Mass.295.2598
SMILESCC1NN(c2nc(cc(O)c12)C(F)(F)F)c1ccccc1