Reaction Details
TargetLysosomal acid glucosylceramidase
LigandBDBM50075408
Substrate/Competitorn/a
Meas. Tech.Fluorescene-based Assay
pH7±0
Ki 5±0.01 nM
Citation Hill, TTropak, MBMahuran, DWithers, SG Synthesis, kinetic evaluation and cell-based analysis of C-alkylated isofagomines as chaperones of β-glucocerebrosidase. Chembiochem12:2151-4 (2011) 
 
Lysosomal acid glucosylceramidase
Name:Lysosomal acid glucosylceramidase
Type:Enzyme
Mol. Mass.:59724.64
Organism:Homo sapiens (Human)
Description:The beta-Glu activity was measured with commercially available beta-glucocerebrosidase (Ceredase) as the enzyme source.
Residue:536
BDBM50075408
NameBDBM50075408
Synonyms:5-(hydroxymethyl)piperidine-3,4-diol Isofagomine derivative, 3
TypeSmall organic molecule
Emp. Form.C6H13NO3
Mol. Mass.147.1723
SMILESOCC1CNCC(O)C1O