Reaction Details
Target5-hydroxytryptamine receptor 4
LigandBDBM81781
Substrate/Competitorn/a
Ki 398.1±n/a nM
CommentsPDSP_164
Citation Bonhaus, DWBerger, JAdham, NBranchek, TAHsu, SALoury, DNLeung, EWong, EHClark, RDEglen, RM [3H]RS 57639, a high affinity, selective 5-HT4 receptor partial agonist, specifically labels guinea-pig striatal and rat cloned (5-HT4S and 5-HT4L) receptors. Neuropharmacology36:671-9 (1997) 
 
5-hydroxytryptamine receptor 4
Name:5-hydroxytryptamine receptor 4
Type:Enzyme Catalytic Domain
Mol. Mass.:46117.31
Organism:RAT
Description:5-HT4 HTR4 RAT::Q62758
Residue:406
BDBM81781
NameBDBM81781
Synonyms:5-HT,a-Me | 5-HT,omega-N-Me
Typen/a
Emp. Form.C11H14N2O
Mol. Mass.190.2417
SMILESCn1cc(CCN)c2cc(O)ccc12