Reaction Details
Target5-hydroxytryptamine receptor 4
LigandBDBM50007863
Substrate/Competitorn/a
Ki 158.48±n/a nM
CommentsPDSP_623
Citation Bonhaus, DWBerger, JAdham, NBranchek, TAHsu, SALoury, DNLeung, EWong, EHClark, RDEglen, RM [3H]RS 57639, a high affinity, selective 5-HT4 receptor partial agonist, specifically labels guinea-pig striatal and rat cloned (5-HT4S and 5-HT4L) receptors. Neuropharmacology36:671-9 (1997) 
 
5-hydroxytryptamine receptor 4
Name:5-hydroxytryptamine receptor 4
Type:Enzyme Catalytic Domain
Mol. Mass.:46117.31
Organism:RAT
Description:5-HT4 HTR4 RAT::Q62758
Residue:406
BDBM50007863
NameBDBM50007863
Synonyms:6-Methoxy-2-oxo-2,3-dihydro-benzoimidazole-1-carboxylic acid 8-methyl-8-aza-bicyclo[3.2.1]oct-3-yl ester; hydrochloride DAU 6285
TypeSmall organic molecule
Emp. Form.C17H21N3O4
Mol. Mass.331.3663
SMILESCOc1ccc2[nH]c(=O)n(C(=O)OC3CC4CCC(C3)N4C)c2c1