Reaction Details
Target5-hydroxytryptamine receptor 4
LigandBDBM50007871
Substrate/Competitorn/a
Ki 100±n/a nM
CommentsPDSP_956
Citation Bonhaus, DWBerger, JAdham, NBranchek, TAHsu, SALoury, DNLeung, EWong, EHClark, RDEglen, RM [3H]RS 57639, a high affinity, selective 5-HT4 receptor partial agonist, specifically labels guinea-pig striatal and rat cloned (5-HT4S and 5-HT4L) receptors. Neuropharmacology36:671-9 (1997) 
 
5-hydroxytryptamine receptor 4
Name:5-hydroxytryptamine receptor 4
Type:Enzyme Catalytic Domain
Mol. Mass.:46117.31
Organism:RAT
Description:5-HT4 HTR4 RAT::Q62758
Residue:406
BDBM50007871
NameBDBM50007871
Synonyms:CHEMBL8197 TROPISETRON
TypeSmall organic molecule
Emp. Form.C17H20N2O2
Mol. Mass.284.3529
SMILESCN1C2CCC1CC(C2)OC(=O)c1c[nH]c2ccccc12