Reaction Details
Target5-hydroxytryptamine receptor 4
LigandBDBM82422
Substrate/Competitorn/a
Ki 25.11±n/a nM
CommentsPDSP_1594
Citation Bonhaus, DWBerger, JAdham, NBranchek, TAHsu, SALoury, DNLeung, EWong, EHClark, RDEglen, RM [3H]RS 57639, a high affinity, selective 5-HT4 receptor partial agonist, specifically labels guinea-pig striatal and rat cloned (5-HT4S and 5-HT4L) receptors. Neuropharmacology36:671-9 (1997) 
 
5-hydroxytryptamine receptor 4
Name:5-hydroxytryptamine receptor 4
Type:Enzyme Catalytic Domain
Mol. Mass.:46117.31
Organism:RAT
Description:5-HT4 HTR4 RAT::Q62758
Residue:406
BDBM82422
NameBDBM82422
Synonyms:CAS_109872-41-5 RENZAPRIDE
TypeSmall organic molecule
Emp. Form.C16H22ClN3O2
Mol. Mass.323.818
SMILESCOc1cc(N)c(Cl)cc1C(=O)NC1CCN2CCCC1C2