Reaction Details
Target5-hydroxytryptamine receptor 4
LigandBDBM85135
Substrate/Competitorn/a
Ki 1.25±n/a nM
CommentsPDSP_1622
Citation Bonhaus, DWBerger, JAdham, NBranchek, TAHsu, SALoury, DNLeung, EWong, EHClark, RDEglen, RM [3H]RS 57639, a high affinity, selective 5-HT4 receptor partial agonist, specifically labels guinea-pig striatal and rat cloned (5-HT4S and 5-HT4L) receptors. Neuropharmacology36:671-9 (1997) 
 
5-hydroxytryptamine receptor 4
Name:5-hydroxytryptamine receptor 4
Type:Enzyme Catalytic Domain
Mol. Mass.:46117.31
Organism:RAT
Description:5-HT4 HTR4 RAT::Q62758
Residue:406
BDBM85135
NameBDBM85135
Synonyms:RS 57639
TypeSmall organic molecule
Emp. Form.C24H29ClN2O5
Mol. Mass.460.95
SMILESCOc1cc(N)c(Cl)cc1C(=O)OCC1CCN(CCc2ccc3OCCOc3c2)CC1