Reaction Details
Target5-hydroxytryptamine receptor 4
LigandBDBM82505
Substrate/Competitorn/a
Ki 0.39±n/a nM
CommentsPDSP_1672
Citation Bonhaus, DWBerger, JAdham, NBranchek, TAHsu, SALoury, DNLeung, EWong, EHClark, RDEglen, RM [3H]RS 57639, a high affinity, selective 5-HT4 receptor partial agonist, specifically labels guinea-pig striatal and rat cloned (5-HT4S and 5-HT4L) receptors. Neuropharmacology36:671-9 (1997) 
 
5-hydroxytryptamine receptor 4
Name:5-hydroxytryptamine receptor 4
Type:Enzyme Catalytic Domain
Mol. Mass.:46117.31
Organism:RAT
Description:5-HT4 HTR4 RAT::Q62758
Residue:406
BDBM82505
NameBDBM82505
Synonyms:CAS_121881 SB204070
TypeSmall organic molecule
Emp. Form.C19H27ClN2O4
Mol. Mass.382.882
SMILESCCCCN1CCC(COC(=O)c2cc(Cl)c(N)c3OCCOc23)CC1