Reaction Details
Target5-hydroxytryptamine receptor 6
LigandBDBM50024202
Substrate/Competitorn/a
Ki 3.01±n/a nM
CommentsPDSP_162
Citation Boess, FGMonsma, FJCarolo, CMeyer, VRudler, AZwingelstein, CSleight, AJ Functional and radioligand binding characterization of rat 5-HT6 receptors stably expressed in HEK293 cells. Neuropharmacology36:713-20 (1997) 
 
5-hydroxytryptamine receptor 6
Name:5-hydroxytryptamine receptor 6
Type:Enzyme Catalytic Domain
Mol. Mass.:46945.51
Organism:RAT
Description:5-HT6 HTR6 RAT::P31388
Residue:436
BDBM50024202
NameBDBM50024202
Synonyms:5-HT,omega-N-Me CHEMBL277362 | N-methylserotonin
TypeSmall organic molecule
Emp. Form.C11H14N2O
Mol. Mass.190.2417
SMILESCNCCc1c[nH]c2ccc(O)cc12