Reaction Details
Target5-hydroxytryptamine receptor 6
LigandBDBM50024206
Substrate/Competitorn/a
Ki 112.2±n/a nM
CommentsPDSP_437
Citation Boess, FGMonsma, FJCarolo, CMeyer, VRudler, AZwingelstein, CSleight, AJ Functional and radioligand binding characterization of rat 5-HT6 receptors stably expressed in HEK293 cells. Neuropharmacology36:713-20 (1997) 
 
5-hydroxytryptamine receptor 6
Name:5-hydroxytryptamine receptor 6
Type:Enzyme Catalytic Domain
Mol. Mass.:46945.51
Organism:RAT
Description:5-HT6 HTR6 RAT::P31388
Residue:436
BDBM50024206
NameBDBM50024206
Synonyms:3-[2-(dimethylamino)ethyl]-1H-indol-5-ol 3-[2-(dimethylamino)ethyl]indol-5-ol 5-hydroxy-N,N-dimethyltryptamine Bufotenine DM5-HT N,N-dimethylserotonin
TypeSmall organic molecule
Emp. Form.C12H16N2O
Mol. Mass.204.2682
SMILESCN(C)CCc1c[nH]c2ccc(O)cc12