Reaction Details
TargetGastrin/cholecystokinin type B receptor
LigandBDBM85139
Substrate/Competitorn/a
Ki 177.83±n/a nM
CommentsPDSP_83
Citation Henke, BRAquino, CJBirkemo, LSCroom, DKDougherty, RWErvin, GNGrizzle, MKHirst, GCJames, MKJohnson, MFQueen, KLSherrill, RGSugg, EESuh, EMSzewczyk, JWUnwalla, RJYingling, JWillson, TM Optimization of 3-(1H-indazol-3-ylmethyl)-1,5-benzodiazepines as potent, orally active CCK-A agonists. J Med Chem40:2706-25 (1997) 
 
Gastrin/cholecystokinin type B receptor
Name:Gastrin/cholecystokinin type B receptor
Type:G Protein-Coupled Receptor (GPCR)
Mol. Mass.:48445.79
Organism:Homo sapiens (Human)
Description:Stable expression of human CCK-2 receptors in HEK 293 cells.
Residue:447
BDBM85139
NameBDBM85139
Synonyms:CCK-A Agonist 37
TypeSmall organic molecule
Emp. Form.C34H31N5O3
Mol. Mass.557.6416
SMILESCC(C)N(C(=O)CN1c2ccccc2N(c2ccccc2)C(=O)C(Cc2n[nH]c3ccccc23)C1=O)c1ccccc1