Reaction Details
TargetHematopoietic prostaglandin D synthase
LigandBDBM82213
Substrate/Competitorn/a
Ki 21±n/a nM
CommentsPDSP_1458
Citation Kiriyama, MUshikubi, FKobayashi, THirata, MSugimoto, YNarumiya, S Ligand binding specificities of the eight types and subtypes of the mouse prostanoid receptors expressed in Chinese hamster ovary cells. Br J Pharmacol122:217-24 (1997) 
 
Hematopoietic prostaglandin D synthase
Name:Hematopoietic prostaglandin D synthase
Type:Enzyme Catalytic Domain
Mol. Mass.:23227.26
Organism:MOUSE
Description:Prostaglandin D PTGDR MOUSE::Q9JHF7
Residue:199
BDBM82213
NameBDBM82213
Synonyms:CAS_41598-07-6 PGD2
TypeSmall organic molecule
Emp. Form.C20H30O4
Mol. Mass.334.4498
SMILESCCCCCC(O)CC=C1C(CC=CCCCC(O)=O)C=CC1=O