Reaction Details
TargetProstaglandin E2 receptor EP3 subtype
LigandBDBM85179
Substrate/Competitorn/a
Ki 170±n/a nM
CommentsPDSP_518
Citation Kiriyama, MUshikubi, FKobayashi, THirata, MSugimoto, YNarumiya, S Ligand binding specificities of the eight types and subtypes of the mouse prostanoid receptors expressed in Chinese hamster ovary cells. Br J Pharmacol122:217-24 (1997) 
 
Prostaglandin E2 receptor EP3 subtype
Name:Prostaglandin E2 receptor EP3 subtype
Type:G-protein coupled receptor
Mol. Mass.:40092.50
Organism:Mus musculus (Mouse)
Description:n/a
Residue:365
BDBM85179
NameBDBM85179
Synonyms:CAS_94079-80-8 NSC_72023
TypeSmall organic molecule
Emp. Form.C22H30O5
Mol. Mass.374.4706
SMILESCCC#CCC(C)C(O)C#CC1C(O)CC2CC(CC12)=CCOCC(O)=O