Reaction Details
TargetProstaglandin E2 receptor EP3 subtype
LigandBDBM85177
Substrate/Competitorn/a
Ki 0.68±n/a nM
CommentsPDSP_1159
Citation Kiriyama, MUshikubi, FKobayashi, THirata, MSugimoto, YNarumiya, S Ligand binding specificities of the eight types and subtypes of the mouse prostanoid receptors expressed in Chinese hamster ovary cells. Br J Pharmacol122:217-24 (1997) 
 
Prostaglandin E2 receptor EP3 subtype
Name:Prostaglandin E2 receptor EP3 subtype
Type:G-protein coupled receptor
Mol. Mass.:40092.50
Organism:Mus musculus (Mouse)
Description:n/a
Residue:365
BDBM85177
NameBDBM85177
Synonyms:CAS_80558-61-8 NSC_119139
TypeSmall organic molecule
Emp. Form.C22H30O5
Mol. Mass.374.4706
SMILESOC(COc1ccccc1)C=CC1CCC(=O)C1CCCCCCC(O)=O