Reaction Details
TargetProstaglandin E2 receptor EP3 subtype
LigandBDBM85178
Substrate/Competitorn/a
Ki 67±n/a nM
CommentsPDSP_1237
Citation Kiriyama, MUshikubi, FKobayashi, THirata, MSugimoto, YNarumiya, S Ligand binding specificities of the eight types and subtypes of the mouse prostanoid receptors expressed in Chinese hamster ovary cells. Br J Pharmacol122:217-24 (1997) 
 
Prostaglandin E2 receptor EP3 subtype
Name:Prostaglandin E2 receptor EP3 subtype
Type:G-protein coupled receptor
Mol. Mass.:40092.50
Organism:Mus musculus (Mouse)
Description:n/a
Residue:365
BDBM85178
NameBDBM85178
Synonyms:CAS_59122-46-2 MISOPROSTOL (Methyl Ester) | NSC_5282381
TypeSmall organic molecule
Emp. Form.C22H38O5
Mol. Mass.382.5341
SMILESCCCCC(C)(O)CC=CC1C(O)CC(=O)C1CCCCCCC(=O)OC