Reaction Details
TargetProstaglandin E2 receptor EP3 subtype
LigandBDBM85183
Substrate/Competitorn/a
Ki 0.6±n/a nM
CommentsPDSP_1786
Citation Kiriyama, MUshikubi, FKobayashi, THirata, MSugimoto, YNarumiya, S Ligand binding specificities of the eight types and subtypes of the mouse prostanoid receptors expressed in Chinese hamster ovary cells. Br J Pharmacol122:217-24 (1997) 
 
Prostaglandin E2 receptor EP3 subtype
Name:Prostaglandin E2 receptor EP3 subtype
Type:G-protein coupled receptor
Mol. Mass.:40092.50
Organism:Mus musculus (Mouse)
Description:n/a
Residue:365
BDBM85183
NameBDBM85183
Synonyms:CAS_60325-46-4 SULPROSTONE
TypeSmall organic molecule
Emp. Form.C23H31NO7S
Mol. Mass.465.56
SMILESCS(=O)(=O)NC(=O)CCCC=CCC1C(C=CC(O)COc2ccccc2)C(O)CC1=O