Reaction Details
TargetProstaglandin E2 receptor EP4 subtype
LigandBDBM82094
Substrate/Competitorn/a
Ki 1000±n/a nM
CommentsPDSP_1464
Citation Kiriyama, MUshikubi, FKobayashi, THirata, MSugimoto, YNarumiya, S Ligand binding specificities of the eight types and subtypes of the mouse prostanoid receptors expressed in Chinese hamster ovary cells. Br J Pharmacol122:217-24 (1997) 
 
Prostaglandin E2 receptor EP4 subtype
Name:Prostaglandin E2 receptor EP4 subtype
Type:G-protein coupled receptor
Mol. Mass.:56175.66
Organism:Mus musculus (Mouse)
Description:n/a
Residue:513
BDBM82094
NameBDBM82094
Synonyms:17-PHENYL TRINOR PROSTAGLANDIN E2 PGE2,17-Phenyl
TypeSmall organic molecule
Emp. Form.C23H30O5
Mol. Mass.386.4813
SMILESO[C@@H](CCc1ccccc1)\C=C\[C@H]1[C@H](O)CC(=O)[C@@H]1C\C=C/CCCC(O)=O