Reaction Details
TargetProstaglandin F2-alpha receptor
LigandBDBM85175
Substrate/Competitorn/a
Ki 1700±n/a nM
CommentsPDSP_453
Citation Kiriyama, MUshikubi, FKobayashi, THirata, MSugimoto, YNarumiya, S Ligand binding specificities of the eight types and subtypes of the mouse prostanoid receptors expressed in Chinese hamster ovary cells. Br J Pharmacol122:217-24 (1997) 
 
Prostaglandin F2-alpha receptor
Name:Prostaglandin F2-alpha receptor
Type:Enzyme Catalytic Domain
Mol. Mass.:40714.02
Organism:MOUSE
Description:ProstaglandinF2Alpha PTGFR MOUSE::P43117
Residue:366
BDBM85175
NameBDBM85175
Synonyms:BW245C NSC_3080928
TypeSmall organic molecule
Emp. Form.C19H32N2O5
Mol. Mass.368.4678
SMILESOC(CCn1c(CCCCCCC(O)=O)c(O)[nH]c1=O)C1CCCCC1