Reaction Details
TargetProstaglandin F2-alpha receptor
LigandBDBM35847
Substrate/Competitorn/a
Ki 100±n/a nM
CommentsPDSP_1462
Citation Kiriyama, MUshikubi, FKobayashi, THirata, MSugimoto, YNarumiya, S Ligand binding specificities of the eight types and subtypes of the mouse prostanoid receptors expressed in Chinese hamster ovary cells. Br J Pharmacol122:217-24 (1997) 
 
Prostaglandin F2-alpha receptor
Name:Prostaglandin F2-alpha receptor
Type:Enzyme Catalytic Domain
Mol. Mass.:40714.02
Organism:MOUSE
Description:ProstaglandinF2Alpha PTGFR MOUSE::P43117
Residue:366
BDBM35847
NameBDBM35847
Synonyms:(15S)-prostaglandin E2 (5Z,13E,15S)-11alpha,15-dihydroxy-9-oxoprosta-5,13-dien-1-oic acid CHEMBL548 PGE2 [3H]PGE2 prostaglandin E2
Typeradiolabeled ligand
Emp. Form.C20H32O5
Mol. Mass.352.4651
SMILESCCCCC[C@H](O)\C=C\[C@H]1[C@H](O)CC(=O)[C@@H]1C\C=C/CCCC(O)=O